Target
Muscarinic acetylcholine receptor M4
Ligand
BDBM50010101
Substrate
Ki
5.50±n/a nM
Comments
PDSP_3900
Citation
 Lazareno, SBuckley, NJRoberts, FF Characterization of muscarinic M4 binding sites in rabbit lung, chicken heart, and NG108-15 cells. Mol Pharmacol 38:805-15 (1990) Target
Name:
Muscarinic acetylcholine receptor M4
Synonyms:
ACM4_CHICK Cholinergic, muscarinic M4
Type:
Enzyme Catalytic Domain
Mol. Mass.:
54968.10
Organism:
Chick
Description:
Cholinergic, muscarinic M4 CHRM4 Chick::P17200
Residue:
490
  
Inhibitor
Name:
BDBM50010101
Synonyms:
2-(diethylamino)ethyl 1-cyclohexylcyclohexanecarboxylate Bicyclohexyl-1-carboxylic acid 2-diethylamino-ethyl ester DICYCLOMINE | Dicycloverin
Type:
Small organic molecule
Emp. Form.:
C19H35NO2
Mol. Mass.:
309.4867
SMILES:
CCN(CC)CCOC(=O)C1(CCCCC1)C1CCCCC1
: