Target
Beta-arrestin-1
Ligand
BDBM50002829
Substrate
Ki
1.1±n/a nM
Comments
PDSP_1053
Citation
 Hwang, SBLam, MHAlberts, AWBugianesi, RLChabala, JCPonpipom, MM Biochemical and pharmacological characterization of L-659,989: an extremely potent, selective and competitive receptor antagonist of platelet-activating factor. J Pharmacol Exp Ther 246:534-41 (1988) Target
Name:
Beta-arrestin-1
Synonyms:
ARRB1 Beta-arrestin-1 OPIATE Delta | PAF Platelet activating factor
Type:
Enzyme Catalytic Domain
Mol. Mass.:
46360.54
Organism:
RABBIT
Description:
Cholinergic, muscarinic 0 RABBIT::Q95223
Residue:
410
  
Inhibitor
Name:
BDBM50002829
Synonyms:
(2S,5S)-2-(3-Methanesulfonyl-5-methoxy-4-propoxy-phenyl)-5-(3,4,5-trimethoxy-phenyl)-tetrahydro-furan L-659,989 L-659989 | L-662,418
Type:
Small organic molecule
Emp. Form.:
C24H32O8S
Mol. Mass.:
480.571
SMILES:
CCCOc1c(OC)cc(cc1S(C)(=O)=O)[C@@H]1CC[C@H](O1)c1cc(OC)c(OC)c(OC)c1
: