Target
Beta-arrestin-1
Ligand
BDBM82381
Substrate
Ki
0.51±n/a nM
Comments
PDSP_1054
Citation
 Hwang, SBLam, MHAlberts, AWBugianesi, RLChabala, JCPonpipom, MM Biochemical and pharmacological characterization of L-659,989: an extremely potent, selective and competitive receptor antagonist of platelet-activating factor. J Pharmacol Exp Ther 246:534-41 (1988) Target
Name:
Beta-arrestin-1
Synonyms:
ARRB1 Beta-arrestin-1 OPIATE Delta | PAF Platelet activating factor
Type:
Enzyme Catalytic Domain
Mol. Mass.:
46360.54
Organism:
RABBIT
Description:
Cholinergic, muscarinic 0 RABBIT::Q95223
Residue:
410
  
Inhibitor
Name:
BDBM82381
Synonyms:
L-659,989, (-)
Type:
Emp. Form.:
C24H32O8S
Mol. Mass.:
480.571
SMILES:
CCCOc1c(OC)cc(cc1S(C)(=O)=O)[C@H]1CC[C@@H](O1)c1cc(OC)c(OC)c(OC)c1
: