Target
Neuromedin-K receptor
Ligand
BDBM50081197
Substrate
Meas. Tech.
Aequorin Assay with Human NK-3 Receptor
IC50
33.0±n/a nM
Citation
 Hoveyda, HRDutheuil, GFraser, GLRoy, MBousmaqui, MEBatt, F Chiral N-acyl-5,6,7,(8-substituted)-tetrahydro-[1,2,4]triazolo[4,3-a]pyrazines as selective NK-3 receptor antagonists, pharmaceutical composition, methods for use in NK-3 receptor mediated disorders and chiral synthesis thereof US Patent  US10065961 Publication Date 9/4/2018 
Target
Name:
Neuromedin-K receptor
Synonyms:
NK-3 receptor NK3R NKR Neurokinin B receptor Neuromedin-3 receptor (NK-3R) Neuromedin-K receptor Neuromedin-K receptor (NK3) TAC3R Tachykinin receptor 3 | Tachykinin receptor 3 (NK3)
Type:
Enzyme
Mol. Mass.:
52221.96
Organism:
Homo sapiens (Human)
Description:
P29371
Residue:
465
  
Inhibitor
Name:
BDBM50081197
Synonyms:
CHEMBL3422017 US10683295, Compound 23 US9475814, 23
Type:
Small organic molecule
Emp. Form.:
C20H18N6O2S
Mol. Mass.:
406.461
SMILES:
C[C@H]1N(CCn2c1nnc2-c1nc(C)no1)C(=O)c1ccc(cc1)-c1cccs1
: