Target
Substance-K receptor
Ligand
BDBM50081363
Substrate
Meas. Tech.
Human NK2 Assay
pH
7.4±n/a
Temperature
298.15±n/a K
Ki
>10000±n/a nM
Comments
extracted
Citation
 Hoveyda, HRDutheuil, GFraser, GLRoy, MBousmaqui, MEBatt, F Chiral N-acyl-5,6,7,(8-substituted)-tetrahydro-[1,2,4]triazolo[4,3-a]pyrazines as selective NK-3 receptor antagonists, pharmaceutical composition, methods for use in NK-3 receptor mediated disorders and chiral synthesis thereof US Patent  US10065961 Publication Date 9/4/2018 
Target
Name:
Substance-K receptor
Synonyms:
NK-2 receptor NK2R NKNAR Neurokinin A receptor Neurokinin-2 (NK-2) SKR TACR2 Tachykinin receptor 2 (NK2) | hnk-3
Type:
Protein
Mol. Mass.:
44455.78
Organism:
Homo sapiens (Human)
Description:
P21452
Residue:
398
  
Inhibitor
Name:
BDBM50081363
Synonyms:
CHEMBL3422012 US10683295, Compound 3 US9475814, 3
Type:
Small organic molecule
Emp. Form.:
C20H17N5OS2
Mol. Mass.:
407.512
SMILES:
Cc1nc(cs1)-c1nnc2CN(CCn12)C(=O)c1ccc(cc1)-c1cccs1
: