Target
Melanocyte-stimulating hormone receptor
Ligand
BDBM82416
Substrate
Ki
1.39±n/a nM
Comments
PDSP_2959
Citation
 Schiöth, HBMuceniece, RWikberg, JEChhajlani, V Characterisation of melanocortin receptor subtypes by radioligand binding analysis. Eur J Pharmacol 288:311-7 (1995)  
Target
Name:
Melanocyte-stimulating hormone receptor
Synonyms:
MC1-R MSH-R MSHR_HUMAN Melanocortin receptor (M1 and M4) Melanocortin receptor 1 (MC1-R) | Melanocortin receptor 1 (MC1R)
Type:
Enzyme
Mol. Mass.:
34717.23
Organism:
Homo sapiens (Human)
Description:
Q01726
Residue:
317
  
Inhibitor
Name:
BDBM82416
Synonyms:
Gamma3-MSH
Type:
Small organic molecule
Emp. Form.:
C126H188N44O37S
Mol. Mass.:
2943.179
SMILES:
CSCC[C@H](NC(=O)[C@@H](NC(=O)[C@@H](N)Cc1ccc(O)cc1)C(C)C)C(=O)NCC(=O)N[C@@H](Cc1cnc[nH]1)C(=O)N[C@@H](Cc1ccccc1)C(=O)N[C@@H](CCCN=C(N)N)C(=O)N[C@@H](Cc1c[nH]c2ccccc12)C(=O)N[C@@H](CC(O)=O)C(=O)N[C@@H](CCCN=C(N)N)C(=O)N[C@@H](Cc1ccccc1)C(=O)NCC(=O)N[C@H](CCCN=C(N)N)C(=O)N[C@H](CCCN=C(N)N)C(=O)N[C@H](CC(N)=O)C(=O)NCC(=O)N[C@H](CO)C(=O)N[C@H](CO)C(=O)N[C@H](CO)C(=O)N[C@H](CO)C(=O)NCC(=O)N[C@H](C(C)C)C(=O)NCC(=O)NCC(=O)N[C@H](C)C(=O)N[C@H](C)C(=O)N[C@H](CCC(N)=O)C(O)=O
: