Target
Neurotensin
Ligand
BDBM82419
Substrate
Ki
2000±n/a nM
Comments
PDSP_1756
Citation
 Betancur, CCanton, MGully, DVela, GPélaprat, DRostène, W Characterization and distribution of binding sites for a new neurotensin receptor antagonist ligand, [3H]SR 48692, in the guinea pig brain. J Pharmacol Exp Ther 273:1450-8 (1995) Target
Name:
Neurotensin
Synonyms:
NEUT_CAVPO NTS | Neurotensin
Type:
Enzyme Catalytic Domain
Mol. Mass.:
1681.93
Organism:
GUINEA PIG
Description:
NT 0 GUINEA PIG::P32560
Residue:
13
QLYENKSRRPYIL
  
Inhibitor
Name:
BDBM82419
Synonyms:
SR 49711
Type:
Emp. Form.:
C29H29ClN4O5
Mol. Mass.:
549.017
SMILES:
COc1cccc(OC)c1-c1cc(nn1-c1ccnc2cc(Cl)ccc12)C(=O)N[C@H](C1CCCCC1)C(O)=O
: