Target
Mu-type opioid receptor
Ligand
BDBM82425
Substrate
Ki
0.18±n/a nM
Comments
PDSP_806
Citation
 Raynor, KKong, HMestek, ABye, LSTian, MLiu, JYu, LReisine, T Characterization of the cloned human mu opioid receptor. J Pharmacol Exp Ther 272:423-8 (1995) Target
Name:
Mu-type opioid receptor
Synonyms:
M-OR-1 MOR-1 MUOR1 Mu opiate receptor OPRM1 hMOP | mu-type opioid receptor isoform MOR-1
Type:
G Protein-Coupled Receptor (GPCR)
Mol. Mass.:
44789.51
Organism:
Homo sapiens (Human)
Description:
P35372
Residue:
400
  
Inhibitor
Name:
BDBM82425
Synonyms:
CAS_61677 NSC_61677
Type:
Small organic molecule
Emp. Form.:
C25H33NO4
Mol. Mass.:
411.5338
SMILES:
CCCC(C)(O)C1CC23C=CC1(OC)C1Oc4c5c(CC2N(C)CCC315)ccc4O
: