Target
Neuromedin-K receptor
Ligand
BDBM50051290
Substrate
Ki
0.42±n/a nM
Comments
PDSP_1749
Citation
 Emonds-Alt, XBichon, DDucoux, JPHeaulme, MMiloux, BPoncelet, MProietto, VVan Broeck, DVilain, PNeliat, G SR 142801, the first potent non-peptide antagonist of the tachykinin NK3 receptor. Life Sci 56:0-32 (1995)  
Target
Name:
Neuromedin-K receptor
Synonyms:
Neurokinin NK3 Tachykinin receptor 2
Type:
Enzyme Catalytic Domain
Mol. Mass.:
51187.68
Organism:
Gerbil
Description:
Q2YHR0
Residue:
454
  
Inhibitor
Name:
BDBM50051290
Synonyms:
CHEMBL299377 SR 142801 SR-142801
Type:
Small organic molecule
Emp. Form.:
C35H41Cl2N3O2
Mol. Mass.:
606.625
SMILES:
CN(C(C)=O)C1(CCN(CCCC2(CCCN(C2)C(=O)c2ccccc2)c2ccc(Cl)c(Cl)c2)CC1)c1ccccc1
: