Target
Neuromedin-K receptor
Ligand
BDBM50051290
Substrate
Ki
406±n/a nM
Comments
PDSP_3772
Citation
 Emonds-Alt, XBichon, DDucoux, JPHeaulme, MMiloux, BPoncelet, MProietto, VVan Broeck, DVilain, PNeliat, G SR 142801, the first potent non-peptide antagonist of the tachykinin NK3 receptor. Life Sci 56:0-32 (1995)  
Target
Name:
Neuromedin-K receptor
Synonyms:
NK-3 receptor NK3R_MOUSE Neurokinin 3 receptor Neurokinin NK3 Tac3r Tacr3
Type:
Enzyme Catalytic Domain
Mol. Mass.:
51047.50
Organism:
mouse
Description:
P47937
Residue:
452
  
Inhibitor
Name:
BDBM50051290
Synonyms:
CHEMBL299377 SR 142801 SR-142801
Type:
Small organic molecule
Emp. Form.:
C35H41Cl2N3O2
Mol. Mass.:
606.625
SMILES:
CN(C(C)=O)C1(CCN(CCCC2(CCCN(C2)C(=O)c2ccccc2)c2ccc(Cl)c(Cl)c2)CC1)c1ccccc1
: