Target
5-hydroxytryptamine receptor 2C
Ligand
BDBM82439
Substrate
Ki
>10000±n/a nM
Comments
PDSP_237
Citation
 Cusack, BNelson, ARichelson, E Binding of antidepressants to human brain receptors: focus on newer generation compounds. Psychopharmacology (Berl) 114:559-65 (1994)  
Target
Name:
5-hydroxytryptamine receptor 2C
Synonyms:
5-HT-2C 5-HT2C-INI 5-HTR2C 5-hydroxytryptamine receptor 2C (5-HT-2C) 5HT-1C HTR1C Serotonin (5-HT3) receptor Serotonin Receptor 2C
Type:
G Protein-Coupled Receptor (GPCR)
Mol. Mass.:
51836.79
Organism:
Homo sapiens (Human)
Description:
P28335
Residue:
458
  
Inhibitor
Name:
BDBM82439
Synonyms:
Adinazolam NSC_37632
Type:
Small organic molecule
Emp. Form.:
C19H18ClN5
Mol. Mass.:
351.833
SMILES:
CN(C)Cc1nnc2CN=C(c3ccccc3)c3cc(Cl)ccc3-n12
: