Target
Somatostatin receptor type 4
Ligand
BDBM82460
Substrate
Ki
0.28±n/a nM
Comments
PDSP_1763
Citation
 Hoyer, DLübbert, HBruns, C Molecular pharmacology of somatostatin receptors. Naunyn Schmiedebergs Arch Pharmacol 350:441-53 (1994)  
Target
Name:
Somatostatin receptor type 4
Synonyms:
SS-4-R SS4R Smstr4 | Sstr4
Type:
PROTEIN
Mol. Mass.:
41937.48
Organism:
Mus musculus
Description:
ChEMBL_833920
Residue:
385
  
Inhibitor
Name:
BDBM82460
Synonyms:
L-Ser-L-Ala-L-Asn-L-Ser-L-Asn-L-Pro-L-Ala-L-Met-L-Ala-L-Pro-L-Arg-L-Glu-L-Arg-L-Lys-L-Ala-Gly-L-Cys(1)-L-Lys-L-Asn-L-Phe-L-Phe-L-Trp-L-Lys-L-Thr-L-Phe-L-Thr-L-Ser-L-Cys(1)-OH | somatostatin-28
Type:
Small organic molecule
Emp. Form.:
C137H207N41O39S3
Mol. Mass.:
3148.556
SMILES:
CSCCC(NC(=O)C(C)NC(=O)C1CCCN1C(=O)C(CC(N)=O)NC(=O)C(CO)NC(=O)C(CC(N)=O)NC(=O)C(C)NC(=O)C(N)CO)C(=O)NC(C)C(=O)N1CCC[C@H]1C(=O)NC(CCCN=C(N)N)C(=O)NC(CCC(O)=O)C(=O)NC(CCCN=C(N)N)C(=O)NC(CCCCN)C(=O)NC(C)C(=O)NCC(=O)N[C@H]1CSSC[C@@H](NC(=O)[C@@H](CO)NC(=O)[C@H](NC(=O)[C@@H](Cc2ccccc2)NC(=O)[C@@H](NC(=O)C(CCCCN)NC(=O)[C@@H](Cc2c[nH]c3ccccc23)NC(=O)C(Cc2ccccc2)NC(=O)C(Cc2ccccc2)NC(=O)C(CC(N)=O)NC(=O)C(CCCCN)NC1=O)[C@H](C)O)[C@H](C)O)C(O)=O
: