Target
Mitogen-activated protein kinase 1
Ligand
BDBM272543
Substrate
Meas. Tech.
Active Human ERK2 (hERK2) Activity Assay
IC50
252±n/a nM
Citation
 Lim, JHuang, XFerguson, RDZhou, WBoyce, CWSiliphaivanh, PWitter, DJMaletic, MMKozlowski, JAWilson, KJ Compounds that are ERK inhibitors US Patent  US10065967 Publication Date 9/4/2018 
Target
Name:
Mitogen-activated protein kinase 1
Synonyms:
ERK2 Extracellular signal-regulated kinase 2 Extracellular signal-regulated kinase 2 (ERK2) MAPK 2 MK01_HUMAN Mitogen-activated protein kinase 1 (ERK-2) Mitogen-activated protein kinase 2 PRKM2 | p42-MAPK
Type:
Ser/Thr Protein Kinase
Mol. Mass.:
41392.76
Organism:
Homo sapiens (Human)
Description:
P28482
Residue:
360
  
Inhibitor
Name:
BDBM272543
Synonyms:
3-(2-methylpyridin-4-yl)-5,6,7,9-tetrahydroazepino[3,2-f]indazol-8(1H)-one US10759805, Ex 9 | US9745307, Example 9
Type:
Small organic molecule
Emp. Form.:
C17H16N4O
Mol. Mass.:
292.3351
SMILES:
Cc1cc(ccn1)-c1n[nH]c2cc3NC(=O)CCCc3cc12
: