Target
Mitogen-activated protein kinase 1
Ligand
BDBM272576
Substrate
Meas. Tech.
Active Human ERK2 (hERK2) Activity Assay
IC50
6.40±n/a nM
Citation
 Lim, JHuang, XFerguson, RDZhou, WBoyce, CWSiliphaivanh, PWitter, DJMaletic, MMKozlowski, JAWilson, KJ Compounds that are ERK inhibitors US Patent  US10065967 Publication Date 9/4/2018 
Target
Name:
Mitogen-activated protein kinase 1
Synonyms:
ERK2 Extracellular signal-regulated kinase 2 Extracellular signal-regulated kinase 2 (ERK2) MAPK 2 MK01_HUMAN Mitogen-activated protein kinase 1 (ERK-2) Mitogen-activated protein kinase 2 PRKM2 | p42-MAPK
Type:
Ser/Thr Protein Kinase
Mol. Mass.:
41392.76
Organism:
Homo sapiens (Human)
Description:
P28482
Residue:
360
  
Inhibitor
Name:
BDBM272576
Synonyms:
US10065967, Example 36 US9745307, Example 36
Type:
Small organic molecule
Emp. Form.:
C20H22N4O3
Mol. Mass.:
366.4137
SMILES:
COCCOc1n[nH]c2cc3NC(=O)N(Cc3cc12)[C@H](C)c1ccccc1
: