Target
5-hydroxytryptamine receptor 2A
Ligand
BDBM81769
Substrate
Ki
0.63±n/a nM
Comments
PDSP_1597
Citation
 Roth, BLCraigo, SCChoudhary, MSUluer, AMonsma, FJShen, YMeltzer, HYSibley, DR Binding of typical and atypical antipsychotic agents to 5-hydroxytryptamine-6 and 5-hydroxytryptamine-7 receptors. J Pharmacol Exp Ther 268:1403-10 (1994) Target
Name:
5-hydroxytryptamine receptor 2A
Synonyms:
5-HT-2A 5-HT2A 5-hydroxytryptamine receptor 2A (5HT2A) Htr2 Serotonin Receptor 2A
Type:
G Protein-Coupled Receptor (GPCR)
Mol. Mass.:
52852.05
Organism:
Rattus norvegicus (rat)
Description:
Rat cortex membranes 5-HT2A receptors.
Residue:
471
  
Inhibitor
Name:
BDBM81769
Synonyms:
CAS_79781-95-6 RILAPINE
Type:
Small organic molecule
Emp. Form.:
C22H20ClN3
Mol. Mass.:
361.867
SMILES:
CN1CCN(CC1)C1=Cc2cc(Cl)ccc2C(=CC#N)c2ccccc12
: