Target
Beta-2 adrenergic receptor
Ligand
BDBM50131281
Substrate
Ki
512.86±n/a nM
Comments
PDSP_817
Citation
 Fraundorfer, PFFertel, RHMiller, DDFeller, DR Biochemical and pharmacological characterization of high-affinity trimetoquinol analogs on guinea pig and human beta adrenergic receptor subtypes: evidence for partial agonism. J Pharmacol Exp Ther 270:665-74 (1994) Target
Name:
Beta-2 adrenergic receptor
Synonyms:
ADRB2_CAVPO adrenergic Beta2
Type:
Enzyme Catalytic Domain
Mol. Mass.:
46993.24
Organism:
GUINEA PIG
Description:
adrenergic Beta2 ADRB2 GUINEA PIG::Q8K4Z4
Residue:
418
  
Inhibitor
Name:
BDBM50131281
Synonyms:
5-(1-hydroxy-2-(1-(4-hydroxyphenyl)propan-2-ylamino)ethyl)benzene-1,3-diol CHEMBL32800 | FENOTEROL
Type:
Small organic molecule
Emp. Form.:
C17H21NO4
Mol. Mass.:
303.3529
SMILES:
CC(Cc1ccc(O)cc1)NCC(O)c1cc(O)cc(O)c1
: