Target
Histamine H1 receptor
Ligand
BDBM50292411
Substrate
Ki
0.31±n/a nM
Comments
PDSP_1917
Citation
 Moguilevsky, NVarsalona, FNoyer, MGillard, MGuillaume, JPGarcia, LSzpirer, CSzpirer, JBollen, A Stable expression of human H1-histamine-receptor cDNA in Chinese hamster ovary cells. Pharmacological characterisation of the protein, tissue distribution of messenger RNA and chromosomal localisation of the gene. Eur J Biochem 224:489-95 (1994)  
Target
Name:
Histamine H1 receptor
Synonyms:
HISTAMINE H1 HRH1_CAVPO
Type:
G Protein-Coupled Receptor (GPCR)
Mol. Mass.:
55641.53
Organism:
Cavia porcellus (domestic guinea pig)
Description:
Guinea pig cerebellum was used in binding assay.
Residue:
488
  
Inhibitor
Name:
BDBM50292411
Synonyms:
(E)-2-(3-(pyrrolidin-1-yl)-1-p-tolylprop-1-enyl)pyridine 2-((E)-3-Pyrrolidin-1-yl-1-p-tolyl-propenyl)-pyridine 2-(3-Pyrrolidin-1-yl-1-p-tolyl-propenyl)-pyridine Actidil Allerfed Corphed Myfed TRIPROLIDINE Trilitron Triprolidin
Type:
Small organic molecule
Emp. Form.:
C19H22N2
Mol. Mass.:
278.3914
SMILES:
Cc1ccc(cc1)C(=C/CN1CCCC1)\c1ccccn1
: