Target
Hepatocyte growth factor receptor [1038-1346]
Ligand
BDBM107497
Substrate
Meas. Tech.
c-Met In Vitro Kinase Assay
Temperature
303.15±n/a K
IC50
1435±n/a nM
Comments
extracted
Citation
 Zhong, BShih, CYuan, HZhou, F Highly selective c-Met inhibitors as anticancer agents US Patent  US9695175 Publication Date 7/4/2017 
Target
Name:
Hepatocyte growth factor receptor [1038-1346]
Synonyms:
Hepatocyte growth factor receptor (MET) MET_HUMAN
Type:
Mol. Mass.:
34804.00
Organism:
Homo sapiens (Human)
Description:
c-Met kinase (1038-1346 aa)
Residue:
309
  
Inhibitor
Name:
BDBM107497
Synonyms:
US9695175, 50
Type:
Small organic molecule
Emp. Form.:
C19H13F3N8
Mol. Mass.:
410.3553
SMILES:
Fc1cc2n[nH]cc2cc1C(F)(F)c1nnc2ccc(nn12)-c1cnn(c1)C1CC1
: