Target
Phosphatidylinositol 4,5-bisphosphate 3-kinase catalytic subunit alpha isoform
Ligand
BDBM272988
Substrate
Meas. Tech.
p110alpha (alpha) PI3K Binding Assay
Ki
0.022±n/a nM
Citation
 Braun, MGarland, KHanan, EPurkey, HStaben, STHeald, RAKnight, JMacleod, CLu, AWu, GYeap, SK Tricyclic PI3K inhibitor compounds and methods of use US Patent  US10065970 Publication Date 9/4/2018 
Target
Name:
Phosphatidylinositol 4,5-bisphosphate 3-kinase catalytic subunit alpha isoform
Synonyms:
P42336 PI3-kinase subunit p110-alpha PIK3CA Phosphatidylinositol 3-kinase alpha (PI3Kalpha) Phosphatidylinositol 4,5-bisphosphate 3-kinase (PI3K) Phosphatidylinositol 4,5-bisphosphate 3-kinase catalytic subunit alpha (PI3Kalpha) Phosphatidylinositol 4,5-bisphosphate 3-kinase catalytic subunit alpha isoform (PI3-Ka) Phosphatidylinositol 4,5-bisphosphate 3-kinase catalytic subunit alpha isoform (PI3K p110alpha) Phosphatidylinositol 4,5-bisphosphate 3-kinase catalytic subunit alpha isoform (PI3K-alpha) Phosphatidylinositol 4,5-bisphosphate 3-kinase catalytic subunit alpha isoform (PI3Kalpha p110alpha) Phosphatidylinositol 4,5-bisphosphate 3-kinase catalytic subunit alpha isoform (PIK3CA) Phosphatidylinositol-4,5-bisphosphate 3-kinase catalytic subunit alpha isoform Phosphoinositide 3-Kinase (PI3K), alpha Chain A Phosphoinositide 3-kinases (PI3K) PtdIns-3-kinase p110 | p110 alpha
Type:
Enzyme Subunit
Mol. Mass.:
124294.87
Organism:
Homo sapiens (Human)
Description:
P42336
Residue:
1068
  
Inhibitor
Name:
BDBM272988
Synonyms:
(S)-2-((1-(2-fluoro-4- (1H-1,2,4-triazol-5- yl)phenyl)-7,8,9,10- tetrahydro-6-oxa-2,10a- diazacycloocta[cd]inden-4- yl)oxy)propanamide US10435414, Example 293
Type:
Small organic molecule
Emp. Form.:
C22H21FN6O3
Mol. Mass.:
436.4389
SMILES:
C[C@H](Oc1cc2OCCCCn3c(nc(c1)c23)-c1ccc(cc1F)-c1ncn[nH]1)C(N)=O
: