Target
Alpha-2A adrenergic receptor
Ligand
BDBM81772
Substrate
Ki
365±n/a nM
Comments
PDSP_327
Citation
 O'Rourke, MFIversen, LJLomasney, JWBylund, DB Species orthologs of the alpha-2A adrenergic receptor: the pharmacological properties of the bovine and rat receptors differ from the human and porcine receptors. J Pharmacol Exp Ther 271:735-40 (1994) Target
Name:
Alpha-2A adrenergic receptor
Synonyms:
Alpha-2A adrenergic receptor adrenergic Alpha2A
Type:
Enzyme Catalytic Domain
Mol. Mass.:
48998.96
Organism:
PIG
Description:
adrenergic Alpha2 0 PIG::P18871
Residue:
450
  
Inhibitor
Name:
BDBM81772
Synonyms:
ARC-239 NSC_122211
Type:
Small organic molecule
Emp. Form.:
C25H30N2O3
Mol. Mass.:
406.5173
SMILES:
COc1ccccc1N1CCN(CCC2C(=O)c3ccccc3C(C)(C)C2=O)CC1
: