Target
5-hydroxytryptamine receptor 2B
Ligand
BDBM82516
Substrate
Ki
10.71±n/a nM
Comments
PDSP_282
Citation
 Boess, FGMartin, IL Molecular biology of 5-HT receptors. Neuropharmacology 33:275-317 (1994)  
Target
Name:
5-hydroxytryptamine receptor 2B
Synonyms:
5-HT2B 5HT2B_RAT Serotonin 2b (5-HT2b) receptor Srl
Type:
Enzyme Catalytic Domain
Mol. Mass.:
53668.47
Organism:
RAT
Description:
5-HT2B HTR2B RAT::P30994
Residue:
479
  
Inhibitor
Name:
BDBM82516
Synonyms:
AMESERGIDE NSC_60740
Type:
Small organic molecule
Emp. Form.:
C25H35N3O
Mol. Mass.:
393.5649
SMILES:
CC(C)n1cc2CC3C(CC(CN3C)C(=O)NC3CCCCC3)c3cccc1c23
: