Target
5-hydroxytryptamine receptor 5A
Ligand
BDBM78940
Substrate
Ki
100±n/a nM
Comments
PDSP_1219
Citation
 Boess, FGMartin, IL Molecular biology of 5-HT receptors. Neuropharmacology 33:275-317 (1994)  
Target
Name:
5-hydroxytryptamine receptor 5A
Synonyms:
5-HT-5 5-HT5 5-hydroxytryptamine receptor 5A 5ht5a Serotonin 5a (5-HT5a) receptor | Serotonin receptor 5A
Type:
Enzyme Catalytic Domain
Mol. Mass.:
40749.33
Organism:
MOUSE
Description:
5-HT5 0 MOUSE::P30966
Residue:
357
  
Inhibitor
Name:
BDBM78940
Synonyms:
METHIOTHEPIN Methiothepin mesylate salt cid_3039995 methanesulfonic acid;1-methyl-4-(3-methylsulfanyl-5,6-dihydrobenzo[b][1]benzothiepin-5-yl)piperazine | methanesulfonic acid;1-methyl-4-[3-(methylthio)-5,6-dihydrobenzo[b][1]benzothiepin-5-yl]piperazine
Type:
Small organic molecule
Emp. Form.:
C20H24N2S2
Mol. Mass.:
356.548
SMILES:
CSc1ccc2Sc3ccccc3CC(N3CCN(C)CC3)c2c1
: