Target
5-hydroxytryptamine receptor 5B
Ligand
BDBM50027065
Substrate
Ki
15.84±n/a nM
Comments
PDSP_797
Citation
 Boess, FGMartin, IL Molecular biology of 5-HT receptors. Neuropharmacology 33:275-317 (1994)  
Target
Name:
5-hydroxytryptamine receptor 5B
Synonyms:
5-HT5B 5HT5B_RAT Htr5b Serotonin 5b (5-HT5b) receptor
Type:
Enzyme Catalytic Domain
Mol. Mass.:
41141.95
Organism:
RAT
Description:
5-HT5B 0 RAT::P35365
Residue:
370
  
Inhibitor
Name:
BDBM50027065
Synonyms:
(5'alpha)-12'-hydroxy-2'-methyl-5'-(phenylmethyl)ergotoman-3',6',18-trione 12'-hydroxy-2'-methyl-5'alpha-(phenylmethyl)ergotaman-3',6',18-trione Ergotamin
Type:
Small organic molecule
Emp. Form.:
C33H35N5O5
Mol. Mass.:
581.6615
SMILES:
CN1C[C@@H](C=C2[C@H]1Cc1c[nH]c3cccc2c13)C(=O)N[C@]1(C)O[C@@]2(O)[C@@H]3CCCN3C(=O)[C@H](Cc3ccccc3)N2C1=O
: