Target
5-hydroxytryptamine receptor 6
Ligand
BDBM35256
Substrate
Ki
38.01±n/a nM
Comments
PDSP_1235
Citation
 Boess, FGMartin, IL Molecular biology of 5-HT receptors. Neuropharmacology 33:275-317 (1994)  
Target
Name:
5-hydroxytryptamine receptor 6
Synonyms:
5-HT-6 5-hydroxytryptamine receptor 6 Htr6 Serotonin (5-HT) receptor Serotonin receptor 6
Type:
Enzyme Catalytic Domain
Mol. Mass.:
46945.51
Organism:
RAT
Description:
5-HT6 HTR6 RAT::P31388
Residue:
436
  
Inhibitor
Name:
BDBM35256
Synonyms:
(S)-mianserin MIANSERIN MIANSERIN (-) | Tolvon
Type:
Small organic molecule
Emp. Form.:
C18H20N2
Mol. Mass.:
264.3648
SMILES:
[H][C@]12CN(C)CCN1c1ccccc1Cc1ccccc21
: