Target
Neuromedin-K receptor
Ligand
BDBM29525
Substrate
Ki
>10000±n/a nM
Comments
PDSP_880
Citation
 Gale, JDGrossman, CJWhitehead, JWOxford, AWBunce, KTHumphrey, PP GR113808: a novel, selective antagonist with high affinity at the 5-HT4 receptor. Br J Pharmacol 111:332-8 (1994)  
Target
Name:
Neuromedin-K receptor
Synonyms:
NK-3 receptor NK3R_MOUSE Neurokinin 3 receptor Neurokinin NK3 Tac3r Tacr3
Type:
Enzyme Catalytic Domain
Mol. Mass.:
51047.50
Organism:
mouse
Description:
P47937
Residue:
452
  
Inhibitor
Name:
BDBM29525
Synonyms:
3H-GR113808 GR 113808 [3H]GR113808
Type:
radiolabeled ligand
Emp. Form.:
C19H27N3O4S
Mol. Mass.:
393.5
SMILES:
Cn1cc(C(=O)OCC2CCN(CCNS(C)(=O)=O)CC2)c2ccccc12
: