Target
Adenosine receptor A2a
Ligand
BDBM82522
Substrate
Ki
>10000±n/a nM
Comments
PDSP_2574
Citation
 van Galen, PJvan Bergen, AHGallo-Rodriguez, CMelman, NOlah, MEIJzerman, APStiles, GLJacobson, KA A binding site model and structure-activity relationships for the rat A3 adenosine receptor. Mol Pharmacol 45:1101-11 (1994) Target
Name:
Adenosine receptor A2a
Synonyms:
AA2AR_RAT Adenosine A2 receptor Adenosine Receptors A2a (A2a) Adenosine receptors A2a Rat striatal adenosine A2a receptor
Type:
G Protein-Coupled Receptor (GPCR)
Mol. Mass.:
45015.65
Organism:
Rattus norvegicus (rat)
Description:
Rat A2A receptors expressed in CHO cells.
Residue:
410
  
Inhibitor
Name:
BDBM82522
Synonyms:
7-MethylX CAS_552-62-5 | CHEMBL321248
Type:
Small organic molecule
Emp. Form.:
C6H6N4O2
Mol. Mass.:
166.1374
SMILES:
Cn1cnc2[nH]c(=O)[nH]c(=O)c12
: