Target
Kynurenine/alpha-aminoadipate aminotransferase, mitochondrial
Ligand
BDBM273028
Substrate
Meas. Tech.
KAT-II inhibitory assay
pH
8±n/a
IC50
8.60±n/a nM
Comments
extracted
Citation
 Okuyama, MFukunaga, KUsui, KHayashi, NIijima, DHoriuchi, HItagaki, N Bicyclic or tricyclic heterocyclic compound US Patent  US10065972 Publication Date 9/4/2018 
Target
Name:
Kynurenine/alpha-aminoadipate aminotransferase, mitochondrial
Synonyms:
2-aminoadipate aminotransferase AADAT Alpha-aminoadipate aminotransferase KAT2 Kynurenine aminotransferase II Kynurenine--oxoglutarate aminotransferase II Kynurenine--oxoglutarate transaminase II
Type:
Enzyme
Mol. Mass.:
47353.09
Organism:
Homo sapiens (Human)
Description:
Q8N5Z0
Residue:
425
  
Inhibitor
Name:
BDBM273028
Synonyms:
(R)-2-{5-[1-(fluoromethyl)cyclopropyl]-7-oxo-6,7-dihydro[1,3]thiazolo[5,4-d]pyrimidin-2-yl}pyrrolidine-1-carboxylic acid phenyl ester | US10065972, Example 80
Type:
Small organic molecule
Emp. Form.:
C20H19FN4O3S
Mol. Mass.:
414.453
SMILES:
FCC1(CC1)c1nc2sc(nc2c(=O)[nH]1)[C@H]1CCCN1C(=O)Oc1ccccc1
: