Target
Kynurenine/alpha-aminoadipate aminotransferase, mitochondrial
Ligand
BDBM273163
Substrate
Meas. Tech.
KAT-II inhibitory assay
pH
8±n/a
IC50
16.0±n/a nM
Comments
extracted
Citation
 Okuyama, MFukunaga, KUsui, KHayashi, NIijima, DHoriuchi, HItagaki, N Bicyclic or tricyclic heterocyclic compound US Patent  US10065972 Publication Date 9/4/2018 
Target
Name:
Kynurenine/alpha-aminoadipate aminotransferase, mitochondrial
Synonyms:
2-aminoadipate aminotransferase AADAT Alpha-aminoadipate aminotransferase KAT2 Kynurenine aminotransferase II Kynurenine--oxoglutarate aminotransferase II Kynurenine--oxoglutarate transaminase II
Type:
Enzyme
Mol. Mass.:
47353.09
Organism:
Homo sapiens (Human)
Description:
Q8N5Z0
Residue:
425
  
Inhibitor
Name:
BDBM273163
Synonyms:
(R)-N-benzyl-1-(7-cyclopropyl-5-ethyl-4-oxo-4,5-dihydro[1,3]thiazolo[4,5-d]pyridazin-2-yl)pyrrolidine-2-carboxamide | US10065972, Example 614
Type:
Small organic molecule
Emp. Form.:
C22H25N5O2S
Mol. Mass.:
423.531
SMILES:
CCn1nc(C2CC2)c2sc(nc2c1=O)N1CCC[C@@H]1C(=O)NCc1ccccc1
: