Target
Kynurenine/alpha-aminoadipate aminotransferase, mitochondrial
Ligand
BDBM273184
Substrate
Meas. Tech.
KAT-II inhibitory assay
pH
8±n/a
IC50
560±n/a nM
Comments
extracted
Citation
 Okuyama, MFukunaga, KUsui, KHayashi, NIijima, DHoriuchi, HItagaki, N Bicyclic or tricyclic heterocyclic compound US Patent  US10065972 Publication Date 9/4/2018 
Target
Name:
Kynurenine/alpha-aminoadipate aminotransferase, mitochondrial
Synonyms:
2-aminoadipate aminotransferase AADAT Alpha-aminoadipate aminotransferase KAT2 Kynurenine aminotransferase II Kynurenine--oxoglutarate aminotransferase II Kynurenine--oxoglutarate transaminase II
Type:
Enzyme
Mol. Mass.:
47353.09
Organism:
Homo sapiens (Human)
Description:
Q8N5Z0
Residue:
425
  
Inhibitor
Name:
BDBM273184
Synonyms:
(R)-1-(7-ethyl-6-fluoro-5-oxo-5H-[1,3,4]thiadiazolo[3,2-a]pyrimidin-2-yl)-N-[(4-methylpyridin-2-yl)methyl]pyrrolidine-2-carboxamide | US10065972, Example 664
Type:
Small organic molecule
Emp. Form.:
C19H21FN6O2S
Mol. Mass.:
416.472
SMILES:
CCc1nc2sc(nn2c(=O)c1F)N1CCC[C@@H]1C(=O)NCc1cc(C)ccn1
: