Target
5-hydroxytryptamine receptor 3A
Ligand
BDBM21398
Substrate
Ki
15.4±n/a nM
Comments
PDSP_918
Citation
 Bonhaus, DWLoury, DNJakeman, LBTo, ZDeSouza, AEglen, RMWong, EH [3H]BIMU-1, a 5-hydroxytryptamine3 receptor ligand in NG-108 cells, selectively labels sigma-2 binding sites in guinea pig hippocampus. J Pharmacol Exp Ther 267:961-70 (1993) Target
Name:
5-hydroxytryptamine receptor 3A
Synonyms:
5-HT3 5HT3A_CAVPO HTR3 Serotonin 3a (5-HT3a) receptor
Type:
Enzyme Catalytic Domain
Mol. Mass.:
55657.07
Organism:
GUINEA PIG
Description:
5-HT3 HTR3A GUINEA PIG::O70212
Residue:
490
  
Inhibitor
Name:
BDBM21398
Synonyms:
4-[4-(4-Chloro-phenyl)-4-hydroxy-piperidin-1-yl]-1-(4-fluoro-phenyl)-butan-1-one;propionate(HCl) CHEMBL54 Haloperidol | Haloperidol, 1
Type:
Small organic molecule
Emp. Form.:
C21H23ClFNO2
Mol. Mass.:
375.864
SMILES:
OC1(CCN(CCCC(=O)c2ccc(F)cc2)CC1)c1ccc(Cl)cc1
: