Target
Glucose-6-phosphate dehydrogenase-6-phosphogluconolactonase
Ligand
BDBM81104
Substrate
Meas. Tech.
Dose Response orthogonal assay utilizing the direct end-point detection of NADPH for uHTS small molecule inhibitors of Plasmodium falciparum Glucose-6-phosphate dehydrogenase
IC50
8840±n/a nM
Citation
 PubChem, PC Dose Response orthogonal assay utilizing the direct end-point detection of NADPH for uHTS small molecule inhibitors of Plasmodium falciparum Glucose-6-phosphate dehydrogenase PubChem Bioassay (2011)[AID] 
Target
Name:
Glucose-6-phosphate dehydrogenase-6-phosphogluconolactonase
Synonyms:
Type:
Enzyme Catalytic Domain
Mol. Mass.:
109731.64
Organism:
Plasmodium falciparum 3D7
Description:
gi_12381848
Residue:
950
  
Inhibitor
Name:
BDBM81104
Synonyms:
3-(3,3-Dimethyl-5,8-dioxo-9-phenyl-3,4,8,9-tetrahydro-1H,5H-2-oxa-11-thia-5a,6,9,10-tetraaza-benzo[b ]fluoren-7-yl)-propionic acid SMR000413206 | cid_1850590
Type:
Small organic molecule
Emp. Form.:
C22H20N4O5S
Mol. Mass.:
452.483
SMILES:
CC1(C)Cc2c(CO1)sc1nc3n(-c4ccccc4)c(=O)c(CCC(O)=O)nn3c(=O)c21
: