Target
Glucose-6-phosphate dehydrogenase-6-phosphogluconolactonase
Ligand
BDBM81008
Substrate
Meas. Tech.
Dose Response orthogonal kinetic assay utilizing the direct detection of NADPH for uHTS small molecule inhibitors of Plasmodium falciparum Glucose-6-phosphate dehydrogenase
IC50
26300±n/a nM
Citation
 PubChem, PC Dose Response orthogonal kinetic assay utilizing the direct detection of NADPH for uHTS small molecule inhibitors of Plasmodium falciparum Glucose-6-phosphate dehydrogenase PubChem Bioassay (2011)[AID] 
Target
Name:
Glucose-6-phosphate dehydrogenase-6-phosphogluconolactonase
Synonyms:
Type:
Enzyme Catalytic Domain
Mol. Mass.:
109731.64
Organism:
Plasmodium falciparum 3D7
Description:
gi_12381848
Residue:
950
  
Inhibitor
Name:
BDBM81008
Synonyms:
4-amino-3-ethyl-N-methyl-2-sulfanylidene-1,3-thiazole-5-carboxamide 4-amino-3-ethyl-N-methyl-2-thioxo-2,3-dihydro-1,3-thiazole-5-carboxamide 4-azanyl-3-ethyl-N-methyl-2-sulfanylidene-1,3-thiazole-5-carboxamide SMR000021040 | cid_612424
Type:
Small organic molecule
Emp. Form.:
C7H11N3OS2
Mol. Mass.:
217.312
SMILES:
CCn1c(N)c(sc1=S)C(=O)NC
: