Target
Glucose-6-phosphate dehydrogenase-6-phosphogluconolactonase
Ligand
BDBM47735
Substrate
Meas. Tech.
Dose Response orthogonal kinetic assay utilizing the direct detection of NADPH for uHTS small molecule inhibitors of Plasmodium falciparum Glucose-6-phosphate dehydrogenase
IC50
>80000±n/a nM
Citation
 PubChem, PC Dose Response orthogonal kinetic assay utilizing the direct detection of NADPH for uHTS small molecule inhibitors of Plasmodium falciparum Glucose-6-phosphate dehydrogenase PubChem Bioassay (2011)[AID] 
Target
Name:
Glucose-6-phosphate dehydrogenase-6-phosphogluconolactonase
Synonyms:
Type:
Enzyme Catalytic Domain
Mol. Mass.:
109731.64
Organism:
Plasmodium falciparum 3D7
Description:
gi_12381848
Residue:
950
  
Inhibitor
Name:
BDBM47735
Synonyms:
3-chloranyl-N-(3,3-dimethylbutan-2-yl)-6-nitro-1-benzothiophene-2-carboxamide 3-chloro-6-nitro-N-(1,2,2-trimethylpropyl)benzothiophene-2-carboxamide MLS000583265 cid_2971539
Type:
Small organic molecule
Emp. Form.:
C15H17ClN2O3S
Mol. Mass.:
340.825
SMILES:
CC(NC(=O)c1sc2cc(ccc2c1Cl)[N+]([O-])=O)C(C)(C)C
: