Target
Glucose-6-phosphate dehydrogenase-6-phosphogluconolactonase
Ligand
BDBM63609
Substrate
Meas. Tech.
Dose Response orthogonal kinetic assay utilizing the direct detection of NADPH for uHTS small molecule inhibitors of Plasmodium falciparum Glucose-6-phosphate dehydrogenase
IC50
7300±n/a nM
Citation
 PubChem, PC Dose Response orthogonal kinetic assay utilizing the direct detection of NADPH for uHTS small molecule inhibitors of Plasmodium falciparum Glucose-6-phosphate dehydrogenase PubChem Bioassay (2011)[AID] 
Target
Name:
Glucose-6-phosphate dehydrogenase-6-phosphogluconolactonase
Synonyms:
Type:
Enzyme Catalytic Domain
Mol. Mass.:
109731.64
Organism:
Plasmodium falciparum 3D7
Description:
gi_12381848
Residue:
950
  
Inhibitor
Name:
BDBM63609
Synonyms:
4-methyl-3-[3-[3-(trifluoromethyl)benzyl]oxy-2-thienyl]-1H-1,2,4-triazole-5-thione 4-methyl-3-[3-[[3-(trifluoromethyl)phenyl]methoxy]thiophen-2-yl]-1H-1,2,4-triazole-5-thione MLS000692156 cid_1482515
Type:
Small organic molecule
Emp. Form.:
C15H12F3N3OS2
Mol. Mass.:
371.4
SMILES:
Cn1c(n[nH]c1=S)-c1sccc1OCc1cccc(c1)C(F)(F)F
: