Target
Carboxy-terminal domain RNA polymerase II polypeptide A small phosphatase 1
Ligand
BDBM41093
Substrate
Meas. Tech.
Dose Response confirmation of uHTS hits for Scp-1 phosphatase using a colorimetric assay
IC50
7213±419 nM
Citation
 PubChem, PC Dose Response confirmation of uHTS hits for Scp-1 phosphatase using a colorimetric assay PubChem Bioassay (2011)[AID] 
Target
Name:
Carboxy-terminal domain RNA polymerase II polypeptide A small phosphatase 1
Synonyms:
CTDS1_HUMAN NIF3 SCP1 | carboxy-terminal domain RNA polymerase II polypeptide A small phosphatase 1 isoform 1
Type:
Enzyme Catalytic Domain
Mol. Mass.:
29199.89
Organism:
Homo sapiens (Human)
Description:
gi_10864009
Residue:
261
  
Inhibitor
Name:
BDBM41093
Synonyms:
3,6-bis(chloranyl)-N-[3-([1,3]oxazolo[4,5-b]pyridin-2-yl)phenyl]-1-benzothiophene-2-carboxamide 3,6-dichloro-N-(3-oxazolo[4,5-b]pyridin-2-ylphenyl)benzothiophene-2-carboxamide 3,6-dichloro-N-[3-([1,3]oxazolo[4,5-b]pyridin-2-yl)phenyl]-1-benzothiophene-2-carboxamide SMR000200786 | cid_2013595
Type:
Small organic molecule
Emp. Form.:
C21H11Cl2N3O2S
Mol. Mass.:
440.302
SMILES:
Clc1c(sc2cc(Cl)ccc12)C(=O)Nc1cccc(c1)-c1nc2ncccc2o1
: