Target
C-C chemokine receptor type 6
Ligand
BDBM80094
Substrate
Meas. Tech.
SAR analysis of small molecule antagonists of the CCR6 receptor: a luminescent beta-arrestin assay
IC50
7820±n/a nM
Citation
 PubChem, PC SAR analysis of small molecule antagonists of the CCR6 receptor: a luminescent beta-arrestin assay PubChem Bioassay (2011)[AID] 
Target
Name:
C-C chemokine receptor type 6
Synonyms:
C-C chemokine receptor type 6 CCR6 CKRL3 GPR29 | STRL22
Type:
Enzyme
Mol. Mass.:
42510.84
Organism:
Homo sapiens (Human)
Description:
P51684
Residue:
374
  
Inhibitor
Name:
BDBM80094
Synonyms:
AESCINE SMR000127404 | cid_16211024
Type:
Small organic molecule
Emp. Form.:
C55H86O24
Mol. Mass.:
1131.2569
SMILES:
C\C=C(/C)C(=O)OC1[C@H](OC(C)=O)C2(CO)[C@H](O)C[C@]3(C)C(=CCC4C5(C)CCC(O[C@@H]6O[C@@H]([C@@H](O[C@@H]7O[C@H](CO)[C@@H](O)[C@H](O)[C@H]7O)[C@H](O)[C@H]6O[C@H]6O[C@H](CO)[C@@H](O)[C@H](O)[C@H]6O)C(O)=O)[C@](C)(CO)C5CCC34C)C2CC1(C)C
: