Target
Toll-like receptor 9
Ligand
BDBM65993
Substrate
Meas. Tech.
Fluorescence-based cell-based high throughput dose response assay for inhibitors of TLR9-MyD88 binding
IC50
6084±n/a nM
Citation
 PubChem, PC Fluorescence-based cell-based high throughput dose response assay for inhibitors of TLR9-MyD88 binding PubChem Bioassay (2011)[AID] 
Target
Name:
Toll-like receptor 9
Synonyms:
CD_antigen: CD289 TLR9_HUMAN
Type:
Enzyme
Mol. Mass.:
115889.91
Organism:
Homo sapiens (Human)
Description:
Q9NR96
Residue:
1032
  
Inhibitor
Name:
BDBM65993
Synonyms:
2-[1-[(E)-2-nitrovinyl]-2-naphthoxy]acetic acid ethyl ester MLS000584937 cid_684448 ethyl 2-[1-[(E)-2-nitroethenyl]naphthalen-2-yl]oxyacetate | ethyl 2-[1-[(E)-2-nitroethenyl]naphthalen-2-yl]oxyethanoate
Type:
Small organic molecule
Emp. Form.:
C16H15NO5
Mol. Mass.:
301.294
SMILES:
CCOC(=O)COc1ccc2ccccc2c1\C=C\[N+]([O-])=O
: