Target
Toll-like receptor 9
Ligand
BDBM29681
Substrate
Meas. Tech.
Fluorescence-based cell-based high throughput dose response assay for inhibitors of TLR9-MyD88 binding
IC50
3122±n/a nM
Citation
 PubChem, PC Fluorescence-based cell-based high throughput dose response assay for inhibitors of TLR9-MyD88 binding PubChem Bioassay (2011)[AID] 
Target
Name:
Toll-like receptor 9
Synonyms:
CD_antigen: CD289 TLR9_HUMAN
Type:
Enzyme
Mol. Mass.:
115889.91
Organism:
Homo sapiens (Human)
Description:
Q9NR96
Residue:
1032
  
Inhibitor
Name:
BDBM29681
Synonyms:
2-[(1,2,3,4-tetrafluoro-9-acridinyl)amino]ethanol 2-[[1,2,3,4-tetrakis(fluoranyl)acridin-9-yl]amino]ethanol SMR000204274 | cid_15944846
Type:
Small organic molecule
Emp. Form.:
C15H10F4N2O
Mol. Mass.:
310.2463
SMILES:
OCCNc1c2ccccc2nc2c(F)c(F)c(F)c(F)c12
: