Target
Toll-like receptor 9
Ligand
BDBM43524
Substrate
Meas. Tech.
Fluorescence-based cell-based high throughput dose response assay for inhibitors of TLR9-MyD88 binding
IC50
13716±n/a nM
Citation
 PubChem, PC Fluorescence-based cell-based high throughput dose response assay for inhibitors of TLR9-MyD88 binding PubChem Bioassay (2011)[AID] 
Target
Name:
Toll-like receptor 9
Synonyms:
CD_antigen: CD289 TLR9_HUMAN
Type:
Enzyme
Mol. Mass.:
115889.91
Organism:
Homo sapiens (Human)
Description:
Q9NR96
Residue:
1032
  
Inhibitor
Name:
BDBM43524
Synonyms:
4-(4-fluorophenyl)-2-(methylsulfonyl)-6-(trifluoromethyl)pyrimidine 4-(4-fluorophenyl)-2-methylsulfonyl-6-(trifluoromethyl)pyrimidine SMR000297077 cid_2987363
Type:
Small organic molecule
Emp. Form.:
C12H8F4N2O2S
Mol. Mass.:
320.263
SMILES:
CS(=O)(=O)c1nc(cc(n1)C(F)(F)F)-c1ccc(F)cc1
: