Target
Toll-like receptor 9
Ligand
BDBM51269
Substrate
Meas. Tech.
Fluorescence-based cell-based high throughput dose response assay for inhibitors of TLR9-MyD88 binding
IC50
3593±n/a nM
Citation
 PubChem, PC Fluorescence-based cell-based high throughput dose response assay for inhibitors of TLR9-MyD88 binding PubChem Bioassay (2011)[AID] 
Target
Name:
Toll-like receptor 9
Synonyms:
CD_antigen: CD289 TLR9_HUMAN
Type:
Enzyme
Mol. Mass.:
115889.91
Organism:
Homo sapiens (Human)
Description:
Q9NR96
Residue:
1032
  
Inhibitor
Name:
BDBM51269
Synonyms:
2-Butyl-6-butylamino-benzo[de]isoquinoline-1,3-dione 2-butyl-6-(butylamino)benzo[de]isoquinoline-1,3-quinone SMR000420208 | cid_87935
Type:
Small organic molecule
Emp. Form.:
C20H24N2O2
Mol. Mass.:
324.4168
SMILES:
CCCCNc1ccc2C(=O)N(CCCC)C(=O)c3cccc1c23
: