Target
Toll-like receptor 9
Ligand
BDBM54829
Substrate
Meas. Tech.
Fluorescence-based cell-based high throughput dose response assay for inhibitors of TLR9-MyD88 binding
IC50
4623±n/a nM
Citation
 PubChem, PC Fluorescence-based cell-based high throughput dose response assay for inhibitors of TLR9-MyD88 binding PubChem Bioassay (2011)[AID] 
Target
Name:
Toll-like receptor 9
Synonyms:
CD_antigen: CD289 TLR9_HUMAN
Type:
Enzyme
Mol. Mass.:
115889.91
Organism:
Homo sapiens (Human)
Description:
Q9NR96
Residue:
1032
  
Inhibitor
Name:
BDBM54829
Synonyms:
2-(7-Chloro-4-nitro-benzo[1,2,5]oxadiazol-5-ylamino)-phenol 6-[(7-chloro-4-nitro-1,3-dihydro-2,1,3-benzoxadiazol-5-yl)imino]-1-cyclohexa-2,4-dienone 6-[(7-chloro-4-nitro-1,3-dihydrobenzofurazan-5-yl)imino]cyclohexa-2,4-dien-1-one SMR000516448 | cid_5719581
Type:
Small organic molecule
Emp. Form.:
C12H7ClN4O4
Mol. Mass.:
306.661
SMILES:
[O-]c1ccccc1Nc1cc(Cl)c2[nH+]onc2c1[N+]([O-])=O
: