Target
Beta-lactamase
Ligand
BDBM31063
Substrate
Meas. Tech.
Counterscreen for inhibitors of TLR9-MyD88 binding: fluorescence-based cell-based high throughput dose response assay to identify non-selective inhibitors of the beta-lactamase enzyme (BLA)
IC50
29065±n/a nM
Citation
 PubChem, PC Counterscreen for inhibitors of TLR9-MyD88 binding: fluorescence-based cell-based high throughput dose response assay to identify non-selective inhibitors of the beta-lactamase enzyme (BLA) PubChem Bioassay (2011)[AID] 
Target
Name:
Beta-lactamase
Synonyms:
Beta lactamase
Type:
Enzyme Catalytic Domain
Mol. Mass.:
31513.38
Organism:
Pseudomonas aeruginosa
Description:
gi_114881106
Residue:
286
  
Inhibitor
Name:
BDBM31063
Synonyms:
2-(methylsulfonyl)-4-phenyl-6-(trifluoromethyl)pyrimidine 2-methylsulfonyl-4-phenyl-6-(trifluoromethyl)pyrimidine SMR000022588 | cid_3236803
Type:
Small organic molecule
Emp. Form.:
C12H9F3N2O2S
Mol. Mass.:
302.272
SMILES:
CS(=O)(=O)c1nc(cc(n1)C(F)(F)F)-c1ccccc1
: