Target
Beta-lactamase
Ligand
BDBM83224
Substrate
Meas. Tech.
Counterscreen for inhibitors of TLR9-MyD88 binding: fluorescence-based cell-based high throughput dose response assay to identify non-selective inhibitors of the beta-lactamase enzyme (BLA)
IC50
3518±n/a nM
Citation
 PubChem, PC Counterscreen for inhibitors of TLR9-MyD88 binding: fluorescence-based cell-based high throughput dose response assay to identify non-selective inhibitors of the beta-lactamase enzyme (BLA) PubChem Bioassay (2011)[AID] 
Target
Name:
Beta-lactamase
Synonyms:
Beta lactamase
Type:
Enzyme Catalytic Domain
Mol. Mass.:
31513.38
Organism:
Pseudomonas aeruginosa
Description:
gi_114881106
Residue:
286
  
Inhibitor
Name:
BDBM83224
Synonyms:
(3E)-3-(2-thenylidene)-1,2-dihydrocyclopenta[b]quinoline-9-carboxylic acid [2-(isobutylamino)-2-keto-ethyl] ester MLS000392696 [2-(2-methylpropylamino)-2-oxidanylidene-ethyl] (3E)-3-(thiophen-2-ylmethylidene)-1,2-dihydrocyclopenta[b]quinoline-9-carboxylate cid_5825928
Type:
Small organic molecule
Emp. Form.:
C24H24N2O3S
Mol. Mass.:
420.524
SMILES:
CC(C)CNC(=O)COC(=O)c1c2CC\C(=C/c3cccs3)c2nc2ccccc12
: