Target
Endoribonuclease toxin MazF
Ligand
BDBM83606
Substrate
Meas. Tech.
Dose response confirmation uHTS hits for MazEF TA System activators via a fluorescence-based single-stranded RNase assay
EC50
11000±n/a nM
Citation
 PubChem, PC Dose response confirmation uHTS hits for MazEF TA System activators via a fluorescence-based single-stranded RNase assay PubChem Bioassay (2011)[AID] 
Target
Name:
Endoribonuclease toxin MazF
Synonyms:
MAZF_ECOLI chpAK mazF
Type:
Enzyme Catalytic Domain
Mol. Mass.:
12100.43
Organism:
Escherichia coli str. K-12 substr. MG1655
Description:
gi_16130689
Residue:
111
  
Inhibitor
Name:
BDBM83606
Synonyms:
5-[(2Z)-2-(2,2-dimethyl-6-phenyl-1,3-dioxin-4-ylidene)ethylidene]-2-sulfanylidene-1,3-diazinane-4,6-dione MLS000711190 cid_1617287
Type:
Small organic molecule
Emp. Form.:
C18H16N2O4S
Mol. Mass.:
356.396
SMILES:
[#6]C1([#6])[#8]\[#6](=[#6]/[#6]=[#6]-2/[#6](=O)-[#7]-[#6](=S)-[#7]-[#6]-2=O)-[#6]=[#6](-[#8]1)-c1ccccc1
: