Target
Endoribonuclease toxin MazF
Ligand
BDBM36819
Substrate
Meas. Tech.
Dose response confirmation uHTS hits for MazEF TA System activators via a fluorescence-based single-stranded RNase assay counterscreen
EC50
54000±n/a nM
Citation
 PubChem, PC Dose response confirmation uHTS hits for MazEF TA System activators via a fluorescence-based single-stranded RNase assay counterscreen PubChem Bioassay (2011)[AID] 
Target
Name:
Endoribonuclease toxin MazF
Synonyms:
MAZF_ECOLI chpAK mazF
Type:
Enzyme Catalytic Domain
Mol. Mass.:
12100.43
Organism:
Escherichia coli str. K-12 substr. MG1655
Description:
gi_16130689
Residue:
111
  
Inhibitor
Name:
BDBM36819
Synonyms:
3-Amino-6-thiophen-2-yl-thieno[2,3-b]pyridine-2-carboxylic acid cyclopentylamide 3-amino-N-cyclopentyl-6-thiophen-2-yl-2-thieno[2,3-b]pyridinecarboxamide 3-azanyl-N-cyclopentyl-6-thiophen-2-yl-thieno[2,3-b]pyridine-2-carboxamide SMR000014004 | cid_645027
Type:
Small organic molecule
Emp. Form.:
C17H17N3OS2
Mol. Mass.:
343.466
SMILES:
Nc1c(sc2nc(ccc12)-c1cccs1)C(=O)NC1CCCC1
: