Target
Endoribonuclease toxin MazF
Ligand
BDBM83468
Substrate
Meas. Tech.
Dose response confirmation uHTS hits for MazEF TA System activators via a fluorescence-based single-stranded RNase assay counterscreen
EC50
>99000±n/a nM
Citation
 PubChem, PC Dose response confirmation uHTS hits for MazEF TA System activators via a fluorescence-based single-stranded RNase assay counterscreen PubChem Bioassay (2011)[AID] 
Target
Name:
Endoribonuclease toxin MazF
Synonyms:
MAZF_ECOLI chpAK mazF
Type:
Enzyme Catalytic Domain
Mol. Mass.:
12100.43
Organism:
Escherichia coli str. K-12 substr. MG1655
Description:
gi_16130689
Residue:
111
  
Inhibitor
Name:
BDBM83468
Synonyms:
2-[2-(4-Oxo-1-phenyl-1,4-dihydro-pyrazolo[3,4-d]pyrimidin-5-yl)-acetylamino]-benzoic acid methyl ester 2-[[2-(4-keto-1-phenyl-pyrazolo[3,4-d]pyrimidin-5-yl)acetyl]amino]benzoic acid methyl ester SMR000007852 methyl 2-[2-(4-oxidanylidene-1-phenyl-pyrazolo[3,4-d]pyrimidin-5-yl)ethanoylamino]benzoate | methyl 2-[[2-(4-oxo-1-phenylpyrazolo[3,4-d]pyrimidin-5-yl)acetyl]amino]benzoate
Type:
Small organic molecule
Emp. Form.:
C21H17N5O4
Mol. Mass.:
403.3908
SMILES:
COC(=O)c1ccccc1NC(=O)Cn1cnc2n(ncc2c1=O)-c1ccccc1
: