Target
Orotidine 5'-phosphate decarboxylase
Ligand
BDBM83728
Substrate
Meas. Tech.
Luminescence-based cell-based high throughput dose response assay for activators of the GAA850 frataxin (FXN) promoter
EC50
>59645±n/a nM
Citation
 PubChem, PC Luminescence-based cell-based high throughput dose response assay for activators of the GAA850 frataxin (FXN) promoter PubChem Bioassay (2011)[AID] 
Target
Name:
Orotidine 5'-phosphate decarboxylase
Synonyms:
FXN frataxin pyrA | pyrG
Type:
Enzyme Catalytic Domain
Mol. Mass.:
30195.13
Organism:
Aspergillus niger
Description:
gi_2395
Residue:
277
  
Inhibitor
Name:
BDBM83728
Synonyms:
5-(3,4-dimethoxyphenyl)-N-(2-oxolanylmethyl)-7-(trifluoromethyl)-1,5,6,7-tetrahydropyrazolo[1,5-a]pyrimidine-3-carboxamide 5-(3,4-dimethoxyphenyl)-N-(tetrahydrofurfuryl)-7-(trifluoromethyl)-1,5,6,7-tetrahydropyrazolo[1,5-a]pyrimidine-3-carboxamide SMR000040708 | cid_5389171
Type:
Small organic molecule
Emp. Form.:
C21H25F3N4O4
Mol. Mass.:
454.4428
SMILES:
COc1ccc(cc1OC)C1CC(n2ncc(C(=O)NCC3CCCO3)c2N1)C(F)(F)F
: