Target
Orotidine 5'-phosphate decarboxylase
Ligand
BDBM68588
Substrate
Meas. Tech.
Luminescence-based cell-based high throughput dose response assay for activators of the GAA850 frataxin (FXN) promoter
EC50
>59603±n/a nM
Citation
 PubChem, PC Luminescence-based cell-based high throughput dose response assay for activators of the GAA850 frataxin (FXN) promoter PubChem Bioassay (2011)[AID] 
Target
Name:
Orotidine 5'-phosphate decarboxylase
Synonyms:
FXN frataxin pyrA | pyrG
Type:
Enzyme Catalytic Domain
Mol. Mass.:
30195.13
Organism:
Aspergillus niger
Description:
gi_2395
Residue:
277
  
Inhibitor
Name:
BDBM68588
Synonyms:
2-(4-carbethoxyphenyl)imino-3-(2-furfuryl)-4-keto-1,3-thiazine-6-carboxylic acid methyl ester MLS000118452 cid_1518343 methyl 2-(4-ethoxycarbonylphenyl)imino-3-(furan-2-ylmethyl)-4-oxo-1,3-thiazine-6-carboxylate
Type:
Small organic molecule
Emp. Form.:
C20H18N2O6S
Mol. Mass.:
414.432
SMILES:
CCOC(=O)c1ccc(cc1)\N=c1/sc(cc(=O)n1Cc1ccco1)C(=O)OC
: