Target
Orotidine 5'-phosphate decarboxylase
Ligand
BDBM71529
Substrate
Meas. Tech.
Luminescence-based cell-based high throughput dose response assay for activators of the GAA850 frataxin (FXN) promoter
EC50
>59600±n/a nM
Citation
 PubChem, PC Luminescence-based cell-based high throughput dose response assay for activators of the GAA850 frataxin (FXN) promoter PubChem Bioassay (2011)[AID] 
Target
Name:
Orotidine 5'-phosphate decarboxylase
Synonyms:
FXN frataxin pyrA | pyrG
Type:
Enzyme Catalytic Domain
Mol. Mass.:
30195.13
Organism:
Aspergillus niger
Description:
gi_2395
Residue:
277
  
Inhibitor
Name:
BDBM71529
Synonyms:
6-keto-2-[[2-keto-2-(tetrahydrofurfurylamino)ethyl]thio]-N-(2-methoxyphenyl)-1-methyl-pyrimidine-5-carboxamide N-(2-methoxyphenyl)-1-methyl-6-oxidanylidene-2-[2-oxidanylidene-2-(oxolan-2-ylmethylamino)ethyl]sulfanyl-pyrimidine-5-carboxamide N-(2-methoxyphenyl)-1-methyl-6-oxo-2-[[2-oxo-2-(2-oxolanylmethylamino)ethyl]thio]-5-pyrimidinecarboxamide cid_18572170
Type:
Small organic molecule
Emp. Form.:
C20H24N4O5S
Mol. Mass.:
432.493
SMILES:
COc1ccccc1NC(=O)c1cnc(SCC(=O)NCC2CCCO2)n(C)c1=O
: