Target
Orotidine 5'-phosphate decarboxylase
Ligand
BDBM83842
Substrate
Meas. Tech.
Luminescence-based cell-based high throughput dose response assay for activators of the GAA850 frataxin (FXN) promoter
EC50
>59710±n/a nM
Citation
 PubChem, PC Luminescence-based cell-based high throughput dose response assay for activators of the GAA850 frataxin (FXN) promoter PubChem Bioassay (2011)[AID] 
Target
Name:
Orotidine 5'-phosphate decarboxylase
Synonyms:
FXN frataxin pyrA | pyrG
Type:
Enzyme Catalytic Domain
Mol. Mass.:
30195.13
Organism:
Aspergillus niger
Description:
gi_2395
Residue:
277
  
Inhibitor
Name:
BDBM83842
Synonyms:
MLS002701852 cid_434786
Type:
Small organic molecule
Emp. Form.:
C10H9NO5
Mol. Mass.:
223.1822
SMILES:
[H]C12C=CC3(O)C(=O)OC1([H])OC(=CC23[H])C(N)=O
: